BDBM477145 US10888567, Compound 56
SMILES Nc1noc2nc(NC3CC3)c(F)cc12
InChI Key InChIKey=UVQCLCHLERGNRX-UHFFFAOYSA-N
Data  1 IC50
  Tab Delimited (TSV)   2D SDfile   Computed 3D by Vconf -m prep SDfile
Find this compound or compounds like it in BindingDB:
Activity Spreadsheet -- Enzyme Inhibition Constant Data from BindingDB
Found 1 hit for monomerid = 477145
TargetIndoleamine 2,3-dioxygenase 1(Homo sapiens (Human))
Auckland Uniservices
US Patent
LigandPNGBDBM477145(US10888567, Compound 56)
Affinity DataIC50: >1.00E+5nM. Assay description: Recombinant human IDO1 (rhIDO1) was expressed and purified from cultures of EC538 strain of E. coli transformed with pREP4 and pQE9-IDO plasmid. Reac...
Ligand InfoPC cidPC sid
In DepthDetails US Patent