BDBM477597 N-(1-phenyl-4,5,6,7-tetrahydro-1H-indazol-4-yl)-4,5,6,7-tetrahydro-2,1-benzoxazole-3-carboxamide::US10889564, Example 27
SMILES O=C(NC1CCCc2c1cnn2-c1ccccc1)c1onc2CCCCc12
InChI Key InChIKey=OBJBHYSTPOEYTF-UHFFFAOYSA-N
Data  2 IC50
  Tab Delimited (TSV)   2D SDfile   Computed 3D by Vconf -m prep SDfile
Find this compound or compounds like it in BindingDB:
Activity Spreadsheet -- Enzyme Inhibition Constant Data from BindingDB
Found 1 hit for monomerid = 477597
TargetDihydroorotate dehydrogenase (quinone), mitochondrial(Homo sapiens (Human))
Genase Therapeutics
US Patent
LigandPNGBDBM477597(N-(1-phenyl-4,5,6,7-tetrahydro-1H-indazol-4-yl)-4,...)
Affinity DataIC50:  112nM. Assay description: Assay B: Example compounds as described herein were dispensed with an acoustic liquid handler, Echo 550 (Labcyte) to a maximum volume of 50 nl per we...
Ligand InfoPC cidPC sid
In DepthDetails US Patent