BDBM47766 MLS000676949::N-[(1,5-dimethyl-3-oxidanylidene-2-phenyl-pyrazol-4-yl)carbamothioyl]cyclohexanecarboxamide::N-[(1,5-dimethyl-3-oxo-2-phenylpyrazol-4-yl)carbamothioyl]cyclohexanecarboxamide::N-[(3-keto-1,5-dimethyl-2-phenyl-3-pyrazolin-4-yl)thiocarbamoyl]cyclohexanecarboxamide::N-[[(1,5-dimethyl-3-oxo-2-phenyl-4-pyrazolyl)amino]-sulfanylidenemethyl]cyclohexanecarboxamide::N-{[(1,5-dimethyl-3-oxo-2-phenyl-2,3-dihydro-1H-pyrazol-4-yl)amino]carbonothioyl}cyclohexanecarboxamide::SMR000271138::cid_1327665
SMILES Cc1c(NC(=S)NC(=O)C2CCCCC2)c(=O)n(-c2ccccc2)n1C
InChI Key InChIKey=QJMHREDPJVDLKA-UHFFFAOYSA-N
Data  5 EC50
  Tab Delimited (TSV)   2D SDfile   Computed 3D by Vconf -m prep SDfile
Find this compound or compounds like it in BindingDB:
Activity Spreadsheet -- Enzyme Inhibition Constant Data from BindingDB
Found 5 hits for monomerid = 47766
TargetRegulator of G-protein signaling 8(Homo sapiens (Human))
Nmmlsc
Curated by PubChem BioAssay
LigandPNGBDBM47766(MLS000676949 | N-[(1,5-dimethyl-3-oxidanylidene-2-...)
Affinity DataEC50: >3.00E+4nM. Assay description: University of New Mexico Assay Overview: Assay Support: NIH R21NS057014 HTS to identify small molecule regulators of RGS family protein interaction...
In DepthDetails PCBioAssay
TargetRegulator of G-protein signaling 7(Homo sapiens (Human))
Nmmlsc
Curated by PubChem BioAssay
LigandPNGBDBM47766(MLS000676949 | N-[(1,5-dimethyl-3-oxidanylidene-2-...)
Affinity DataEC50: >3.00E+4nM. Assay description: University of New Mexico Assay Overview: Assay Support: NIH R21NS057014 HTS to identify small molecule regulators of RGS family protein interaction...
In DepthDetails PCBioAssay
TargetRegulator of G-protein signaling 4(Homo sapiens (Human))
Nmmlsc
Curated by PubChem BioAssay
LigandPNGBDBM47766(MLS000676949 | N-[(1,5-dimethyl-3-oxidanylidene-2-...)
Affinity DataEC50:  3.00E+4nM. Assay description: University of New Mexico Assay Overview: Assay Support: NIH R21NS057014 HTS to identify small molecule regulators of RGS family protein interaction...
In DepthDetails PCBioAssay
TargetRegulator of G-protein signaling 16(Homo sapiens (Human))
Nmmlsc
Curated by PubChem BioAssay
LigandPNGBDBM47766(MLS000676949 | N-[(1,5-dimethyl-3-oxidanylidene-2-...)
Affinity DataEC50: >3.00E+4nM. Assay description: University of New Mexico Assay Overview: Assay Support: NIH R21NS057014 HTS to identify small molecule regulators of RGS family protein interaction...
In DepthDetails PCBioAssay
TargetRegulator of G-protein signaling 19(Homo sapiens (Human))
Nmmlsc
Curated by PubChem BioAssay
LigandPNGBDBM47766(MLS000676949 | N-[(1,5-dimethyl-3-oxidanylidene-2-...)
Affinity DataEC50: >3.00E+4nM. Assay description: University of New Mexico Assay Overview: Assay Support: NIH R21NS057014 HTS to identify small molecule regulators of RGS family protein interaction...
In DepthDetails PCBioAssay