BDBM479055 (R)-N-(4-(3-((5-chloro-4- phenoxypyrimidin-2- yl)amino)pyrrolidine-1- carbonyl)phenyl)acrylamide::US10894788, Example 95::US11390618, Example 95
SMILES Clc1cnc(N[C@@H]2CCN(C2)C(=O)c2ccc(NC(=O)C=C)cc2)nc1Oc1ccccc1
InChI Key InChIKey=XKGYBRUDWPRVCG-GOSISDBHSA-N
Data  2 IC50
  Tab Delimited (TSV)   2D SDfile   Computed 3D by Vconf -m prep SDfile
Find this compound or compounds like it in BindingDB:
Activity Spreadsheet -- Enzyme Inhibition Constant Data from BindingDB
Found 1 hit for monomerid = 479055
TargetCyclin-dependent kinase 12(Homo sapiens)
Kinnate Biopharma
US Patent
LigandPNGBDBM479055((R)-N-(4-(3-((5-chloro-4- phenoxypyrimidin-2- yl)a...)
Affinity DataIC50: <100nM. Assay description: The IC50 profile of compounds was determined using one protein kinase in a customized, thiol free assay. IC50 values were measured by testing 10 conc...
Ligand InfoPC cidPC sid
In DepthDetails US Patent