BDBM481042 US10906890, Example 54.0::US10906890, Example 55.0
SMILES COc1ccnc(OC)c1-n1c(NS(=O)(=O)[C@@H](C)[C@H](C)c2cnc(C)cn2)nnc1-c1ccccc1
InChI Key InChIKey=FLMUOBRKILTXLP-IRXDYDNUSA-N
Data  2 EC50
  Tab Delimited (TSV)   2D SDfile   Computed 3D by Vconf -m prep SDfile
Find this compound or compounds like it in BindingDB:
Activity Spreadsheet -- Enzyme Inhibition Constant Data from BindingDB
Found 2 hits for monomerid = 481042
TargetApelin receptor(Homo sapiens (Human))
Amgen
US Patent
LigandPNGBDBM481042(US10906890, Example 54.0 | US10906890, Example 55....)
Affinity DataEC50:  0.330nM. Assay description: The human APJ receptor was cloned by polymerase chain reaction and the gene encoding the receptor was subcloned in pFLAG-CMV™-3 expression vector (Si...
Ligand InfoPC cidPC sid
In DepthDetails US Patent
TargetApelin receptor(Homo sapiens (Human))
Amgen
US Patent
LigandPNGBDBM481042(US10906890, Example 54.0 | US10906890, Example 55....)
Affinity DataEC50:  14nM. Assay description: The human APJ receptor was cloned by polymerase chain reaction and the gene encoding the receptor was subcloned in pFLAG-CMV™-3 expression vector (Si...
Ligand InfoPC cidPC sid
In DepthDetails US Patent