BDBM481594 US10913710, Compound 10
SMILES Clc1ccc(CN(C2CCCC2)S(=O)(=O)c2ccc(cc2)S(=O)(=O)N(CCN2CCNCC2)Cc2ccccc2)cc1
InChI Key InChIKey=PZDIXSHJCMHIBK-UHFFFAOYSA-N
Data  1 Kd
  Tab Delimited (TSV)   2D SDfile   Computed 3D by Vconf -m prep SDfile
Find this compound or compounds like it in BindingDB:
Activity Spreadsheet -- Enzyme Inhibition Constant Data from BindingDB
Found 1 hit for monomerid = 481594
TargetRetinal rod rhodopsin-sensitive cGMP 3',5'-cyclic phosphodiesterase subunit delta(Homo sapiens (Human))
Max-Planck-Gesellschaft Zur Forderung Der Wissenschaften
US Patent
LigandPNGBDBM481594(US10913710, Compound 10)
Affinity DataKd:  16nM. Assay description: Binding to PDEδ was validated and quantified by means of a displacement assay employing a fluorescent-tagged analog of the HMG-CoA reductase inh...
Ligand InfoPC cidPC sid
In DepthDetails US Patent