BDBM481792 5-[(5-methyl-4-oxo-pyrido[2,3- d]pyrimidin-3-yl)methyl]-3- [(2S)-2-(4-chlorophenyl)-2- fluoro-ethyl]-1,3,4-oxadiazol- 2-one::US10913742, Example 34
SMILES Cc1ccnc2ncn(Cc3nn(C[C@H](F)c4ccc(Cl)cc4)c(=O)o3)c(=O)c12
InChI Key InChIKey=LGDQCKVOXHGGTO-AWEZNQCLSA-N
Data  1 IC50
  Tab Delimited (TSV)   2D SDfile   Computed 3D by Vconf -m prep SDfile
Find this compound or compounds like it in BindingDB:
Activity Spreadsheet -- Enzyme Inhibition Constant Data from BindingDB
Found 1 hit for monomerid = 481792
TargetTransient receptor potential cation channel subfamily A member 1(Homo sapiens (Human))
Genentech
US Patent
LigandPNGBDBM481792(5-[(5-methyl-4-oxo-pyrido[2,3- d]pyrimidin-3-yl)me...)
Affinity DataIC50:  5nM. Assay description: The IC50 (effective concentration) of compounds on the human and rat TRPA1 channels were determined using a FLIPR Tetra instrument. CHO cells express...
Ligand InfoPC cidPC sid
In DepthDetails US Patent