BDBM481801 3-(4-chlorophenethyl)-5-((5,7- dimethyl-4-oxoimidazo[1,5- f][1,2,4]triazin-3(4H)- yl)methyl)-1,3,4-oxadiazol- 2(3H)-one::US10913742, Example 43
SMILES Cc1cnc(C#N)c2ncn(Cc3nn(CCc4ccc(Cl)cc4)c(=O)o3)c(=O)c12
InChI Key InChIKey=HEEMVJMUZDPBFI-UHFFFAOYSA-N
Data  1 IC50
  Tab Delimited (TSV)   2D SDfile   Computed 3D by Vconf -m prep SDfile
Find this compound or compounds like it in BindingDB:
Activity Spreadsheet -- Enzyme Inhibition Constant Data from BindingDB
Found 1 hit for monomerid = 481801
TargetTransient receptor potential cation channel subfamily A member 1(Homo sapiens (Human))
Genentech
US Patent
LigandPNGBDBM481801(3-(4-chlorophenethyl)-5-((5,7- dimethyl-4-oxoimida...)
Affinity DataIC50:  18nM. Assay description: The IC50 (effective concentration) of compounds on the human and rat TRPA1 channels were determined using a FLIPR Tetra instrument. CHO cells express...
Ligand InfoPC cidPC sid
In DepthDetails US Patent