BDBM482219 N-{3-[4-Amino-7-(1-methyl-piperidin-4-yl)-7H-pyrrolo[2,3-d]pyrimidin-5-yl]-2-fluoro-phenyl}-2-fluoro-4-methoxy-5-methyl-benzenesulfonamide ::US10918642, Cmpd # 73::US11491158, Cmpd 73
SMILES COc1cc(F)c(cc1C)S(=O)(=O)Nc1cccc(-c2cn(C3CCN(C)CC3)c3ncnc(N)c23)c1F
InChI Key InChIKey=JNPAHHUHFRRLAS-UHFFFAOYSA-N
Data  2 IC50
  Tab Delimited (TSV)   2D SDfile   Computed 3D by Vconf -m prep SDfile
Find this compound or compounds like it in BindingDB:
Activity Spreadsheet -- Enzyme Inhibition Constant Data from BindingDB
Found 2 hits for monomerid = 482219
TargetEukaryotic translation initiation factor 2-alpha kinase 3 [540-1115](Homo sapiens (Human))
Nerviano Medical Sciences
US Patent
LigandPNGBDBM482219(N-{3-[4-Amino-7-(1-methyl-piperidin-4-yl)-7H-pyrro...)
Affinity DataIC50: <16nM. Assay description: The biochemical activity of compounds was determined by incubation with PERK recombinant enzyme (cytoplasmic domain corresponding to residues 540-111...
Ligand InfoPC cidPC sid
In DepthDetails US Patent
TargetEukaryotic translation initiation factor 2-alpha kinase 3(Homo sapiens (Human))
Nerviano Medical Sciences
US Patent
LigandPNGBDBM482219(N-{3-[4-Amino-7-(1-methyl-piperidin-4-yl)-7H-pyrro...)
Affinity DataIC50: <16nM. Assay description: Compounds were 3-fold serially diluted in order to obtain from 3.333 to 0.000169 microM final concentration, then incubated for 60 minutes at room te...
Ligand InfoPC cidPC sid
In DepthDetails US Patent