BDBM483563 N-[(7S)-4-fluorobicyclo[4.2.0]octa-1,3,5- trien-7-yl]-N''-hydroxy-4-({[3-hydroxy-l- (S-methylsulfonimidoyl)azetidin-3- yl]methyl}amino)-1,2,5-oxadiazole-3- carboximidamide (isomer 1)::US10927086, Example 36::US10927086, Example 37
SMILES CS(=N)(=O)N1CC(O)(CNc2nonc2\C(N[C@H]2Cc3ccc(F)cc23)=N\O)C1
InChI Key InChIKey=KCSOKJRCXSPXKL-ZINHSSCWSA-N
Data  2 IC50
  Tab Delimited (TSV)   2D SDfile   Computed 3D by Vconf -m prep SDfile
Find this compound or compounds like it in BindingDB:
Activity Spreadsheet -- Enzyme Inhibition Constant Data from BindingDB
Found 2 hits for monomerid = 483563
TargetIndoleamine 2,3-dioxygenase 1(Homo sapiens (Human))
Merck Sharp & Dohme
US Patent
LigandPNGBDBM483563(N-[(7S)-4-fluorobicyclo[4.2.0]octa-1,3,5- trien-7-...)
Affinity DataIC50:  108nM. Assay description: HIS-tagged IDO1 protein was recombinantly expressed in Escherichia coli using ZYP5052 autoinduction media supplemented with 500 μM delta aminole...
Ligand InfoPC cidPC sid
In DepthDetails US Patent
TargetIndoleamine 2,3-dioxygenase 1(Homo sapiens (Human))
Merck Sharp & Dohme
US Patent
LigandPNGBDBM483563(N-[(7S)-4-fluorobicyclo[4.2.0]octa-1,3,5- trien-7-...)
Affinity DataIC50:  85.7nM. Assay description: HIS-tagged IDO1 protein was recombinantly expressed in Escherichia coli using ZYP5052 autoinduction media supplemented with 500 μM delta aminole...
Ligand InfoPC cidPC sid
In DepthDetails US Patent