BDBM484435 US10934285, Example 19
SMILES Nc1nc(cnc1Sc1cccc(NC(=O)c2c(O)nc3ccccn3c2=O)c1Cl)N1CCC(N)(CC1)C(F)(F)F
InChI Key InChIKey=UDDHNCPRSUCOAW-UHFFFAOYSA-N
Data  1 IC50
  Tab Delimited (TSV)   2D SDfile   Computed 3D by Vconf -m prep SDfile
Find this compound or compounds like it in BindingDB:
Activity Spreadsheet -- Enzyme Inhibition Constant Data from BindingDB
Found 1 hit for monomerid = 484435
TargetSH2B adapter protein 2(Human)
Novartis
US Patent
LigandPNGBDBM484435(US10934285, Example 19)
Affinity DataIC50:  2.19E+3nM. Assay description: The inhibition of SHP2 by compounds of the invention (concentrations varying from 0.003-100 μM) was monitored using an assay in which 0.5 nM of ...
Ligand InfoPC cidPC sid
In DepthDetails US Patent