BDBM486559 US10947251, Example 32
SMILES [H][C@]12CN(CC[C@]1([H])N(CCO2)c1cc(F)c(cc1OC)-c1cccc(OC(F)(F)F)c1)S(=O)(=O)Nc1ccon1
InChI Key InChIKey=CBOWFDJNHGFFDD-UGKGYDQZSA-N
Data  2 IC50
  Tab Delimited (TSV)   2D SDfile   Computed 3D by Vconf -m prep SDfile
Find this compound or compounds like it in BindingDB:
Activity Spreadsheet -- Enzyme Inhibition Constant Data from BindingDB
Found 2 hits for monomerid = 486559
TargetSodium channel protein type 9 subunit alpha(Homo sapiens (Human))
Genentech
US Patent
LigandPNGBDBM486559(US10947251, Example 32)
Affinity DataIC50:  10.9nM. Assay description: Patch voltage clamp electrophysiology allows for the direct measurement and quantification of block of voltage-gated sodium channels (NaV's), and...
Ligand InfoPC cidPC sid
In DepthDetails US Patent
TargetSodium channel protein type 9 subunit alpha(Homo sapiens (Human))
Genentech
US Patent
LigandPNGBDBM486559(US10947251, Example 32)
Affinity DataIC50:  148nM. Assay description: Heterologously Express hNav1.7 and the β1 SubunitPreparation of membranes containing recombinantly expressed sodium channels: Frozen recombinant...
Ligand InfoPC cidPC sid
In DepthDetails US Patent