BDBM48777 2-(2-hydroxy-3,5-dinitro-benzylidene)thiazolo[3,2-a]benzimidazol-1-one::2-[(2-hydroxy-3,5-dinitrophenyl)methylidene]-1-thiazolo[3,2-a]benzimidazolone::2-[(2-hydroxy-3,5-dinitrophenyl)methylidene]-[1,3]thiazolo[3,2-a]benzimidazol-1-one::2-[(3,5-dinitro-2-oxidanyl-phenyl)methylidene]-[1,3]thiazolo[3,2-a]benzimidazol-1-one::MLS000715276::SMR000275255::cid_3098935
SMILES Oc1c(\C=c2/sc3nc4ccccc4n3c2=O)cc(cc1[N+]([O-])=O)[N+]([O-])=O
InChI Key InChIKey=AUGLTWDBBOMCGG-MLPAPPSSSA-N
Data  5 IC50
  Tab Delimited (TSV)   2D SDfile   Computed 3D by Vconf -m prep SDfile
Find this compound or compounds like it in BindingDB:
Activity Spreadsheet -- Enzyme Inhibition Constant Data from BindingDB
Found 5 hits for monomerid = 48777
TargetEukaryotic translation initiation factor 4 gamma 1(Homo sapiens (Human))
Emory University
Curated by PubChem BioAssay
LigandPNGBDBM48777(2-(2-hydroxy-3,5-dinitro-benzylidene)thiazolo[3,2-...)
Affinity DataIC50:  5.00E+4nM. Assay description: Dose Response Confirmation for Small Molecule Inhibitors of Eukaryotic Translation Initiation NIH Molecular Libraries Screening Centers Network [MLSC...
In DepthDetails PCBioAssay
TargetInduced myeloid leukemia cell differentiation protein Mcl-1(Homo sapiens (Human))
Emory University
Curated by PubChem BioAssay
LigandPNGBDBM48777(2-(2-hydroxy-3,5-dinitro-benzylidene)thiazolo[3,2-...)
Affinity DataIC50:  1.54E+3nM. Assay description: NIH Molecular Libraries Screening Centers Network [MLSCN] Emory Chemical Biology Discovery Center in MLSCN Assay provider: Nikolovska-Coleska, Univer...
In DepthDetails PCBioAssay
TargetEnvelope glycoprotein gp160(Human immunodeficiency virus 1)
Burnham Center For Chemical Genomics
Curated by PubChem BioAssay
LigandPNGBDBM48777(2-(2-hydroxy-3,5-dinitro-benzylidene)thiazolo[3,2-...)
Affinity DataIC50:  8.60E+3nM. Assay description: Data Source: Burnham Center for Chemical Genomics (BCCG) Source Affiliation: Sanford-Burnham Medical Research Institute (SBMRI, San Diego, CA) Networ...
In DepthDetails PCBioAssay
TargetInsulin-degrading enzyme(Homo sapiens (Human))
The Scripps Research Institute Molecular Screening Center
Curated by PubChem BioAssay
LigandPNGBDBM48777(2-(2-hydroxy-3,5-dinitro-benzylidene)thiazolo[3,2-...)
Affinity DataIC50: >5.59E+4nM. Assay description: Source (MLPCN Center Name): The Scripps Research Institute Molecular Screening Center (SRIMSC) Center Affiliation: The Scripps Research Institute (TS...
In DepthDetails PCBioAssay
TargetEnvelope glycoprotein gp160(Human immunodeficiency virus 1)
Burnham Center For Chemical Genomics
Curated by PubChem BioAssay
LigandPNGBDBM48777(2-(2-hydroxy-3,5-dinitro-benzylidene)thiazolo[3,2-...)
Affinity DataIC50:  2.61E+3nM. Assay description: Data Source: Burnham Center for Chemical Genomics (BCCG) Source Affiliation: Sanford-Burnham Medical Research Institute (SBMRI, San Diego, CA) Networ...
In DepthDetails PCBioAssay