BDBM488147 US10954217, Example Table 3.A29
SMILES CCOC(=O)CCN1CCN(CC1)c1cccc2CCN(Cc12)C(=O)OCc1ccccc1
InChI Key InChIKey=FMXVLIOHRXXUSD-UHFFFAOYSA-N
Data  2 KI
  Tab Delimited (TSV)   2D SDfile   Computed 3D by Vconf -m prep SDfile
Find this compound or compounds like it in BindingDB:
Activity Spreadsheet -- Enzyme Inhibition Constant Data from BindingDB
Found 2 hits for monomerid = 488147
TargetSigma intracellular receptor 2(Homo sapiens (Human))
Board of Regents, The University of Texas System
US Patent
LigandPNGBDBM488147(US10954217, Example Table 3.A29)
Affinity DataKi:  11.7nM. Assay description: TBD
Ligand InfoPC cidPC sid
In DepthDetails US Patent
TargetSigma non-opioid intracellular receptor 1(Homo sapiens (Human))
Board of Regents, The University of Texas System
US Patent
LigandPNGBDBM488147(US10954217, Example Table 3.A29)
Affinity DataKi:  666nM. Assay description: TBD
Ligand InfoPC cidPC sid
In DepthDetails US Patent