BDBM488551 US10954253, Compound 58
SMILES CN1CCC2(CC1)CCN(CC2)c1ccc(Nc2ncc3c(n2)n(-c2cccc(n2)N2CCN(C(=O)OC(C)(C)C)C2=O)n(CC=C)c3=O)cc1
InChI Key InChIKey=ITURTMHIIMYNPZ-UHFFFAOYSA-N
Data  1 IC50
  Tab Delimited (TSV)   2D SDfile   Computed 3D by Vconf -m prep SDfile
Find this compound or compounds like it in BindingDB:
Activity Spreadsheet -- Enzyme Inhibition Constant Data from BindingDB
Found 1 hit for monomerid = 488551
TargetWee1-like protein kinase(Homo sapiens (Human))
Shijiazhuang Sagacity New Drug Development
US Patent
LigandPNGBDBM488551(US10954253, Compound 58)
Affinity DataIC50:  73nM. Assay description: Experimental Reagents:Basic reaction buffer: 20 mM hydroxyethylpiperazine ethanesulfuric acid (pH 7.5), 10 mM magnesium chloride, 1 mM EGTA, 0.02% Br...
Ligand InfoPC cidPC sid
In DepthDetails US Patent