BDBM488640 US10961228, Example Tofacitinib::US11414413, Example Tofacitinib::US11524961, Compound Toficitinib::US20230348487, Example Tofacitinib
SMILES CC1CCN(CC1N(C)c1ncnc2[nH]ccc12)C(=O)CC#N
InChI Key
Data  15 IC50
  Tab Delimited (TSV)   2D SDfile   Computed 3D by Vconf -m prep SDfile
Find this compound or compounds like it in BindingDB:
Activity Spreadsheet -- Enzyme Inhibition Constant Data from BindingDB
Found 15 hits for monomerid = 488640
TargetTyrosine-protein kinase JAK1 [866-1154](Homo sapiens (Human))
Astrazeneca
US Patent
LigandPNGBDBM488640(US10961228, Example Tofacitinib | US11414413, Exam...)
Affinity DataIC50:  30nM. Assay description: Enzyme inhibition studies were performed using recombinant JAK1 (amino acids 866-1154, Life Technologies, #PV4774, Carlsbad, Calif.), JAK2 (amino aci...
In DepthDetails US Patent
TargetTyrosine-protein kinase JAK3(Homo sapiens (Human))
Guangzhou Salustier Biosciences
US Patent
LigandPNGBDBM488640(US10961228, Example Tofacitinib | US11414413, Exam...)
Affinity DataIC50:  474nM. Assay description: Test method: Firstly, test compounds were prepared into 10 mM stock solution with DMSO, and continuously diluted into 10 concentrations at a 3-fold g...
In DepthDetails US Patent
TargetTyrosine-protein kinase JAK3 [781-1124](Homo sapiens (Human))
Astrazeneca
US Patent
LigandPNGBDBM488640(US10961228, Example Tofacitinib | US11414413, Exam...)
Affinity DataIC50:  74nM. Assay description: Enzyme inhibition studies were performed using recombinant JAK1 (amino acids 866-1154, Life Technologies, #PV4774, Carlsbad, Calif.), JAK2 (amino aci...
In DepthDetails US Patent
TargetTyrosine-protein kinase JAK3(Homo sapiens (Human))
Guangzhou Salustier Biosciences
US Patent
LigandPNGBDBM488640(US10961228, Example Tofacitinib | US11414413, Exam...)
Affinity DataIC50:  3.5nM. Assay description: JAK3 and BTK kinases inhibitory activities were measured for the compounds prepared in the Examples through in vitro analysis on the ADP Glow (Glo) p...
In DepthDetails US Patent
TargetTyrosine-protein kinase JAK1(Homo sapiens (Human))
Shanghai Longwood Biopharmaceuticals
US Patent
LigandPNGBDBM488640(US10961228, Example Tofacitinib | US11414413, Exam...)
Affinity DataIC50:  5nM. Assay description: Kinase Assay:Preparation of buffers, the buffer included 50 mM HEPES (pH 7.5), 0.01% Brij-35, 10 mM MgCl2, and 1 mM EGTA.After the buffer was formula...
In DepthDetails US Patent
TargetTyrosine-protein kinase JAK2(Homo sapiens (Human))
Shanghai Longwood Biopharmaceuticals
US Patent
LigandPNGBDBM488640(US10961228, Example Tofacitinib | US11414413, Exam...)
Affinity DataIC50:  5nM. Assay description: Kinase Assay:Preparation of buffers, the buffer included 50 mM HEPES (pH 7.5), 0.01% Brij-35, 10 mM MgCl2, and 1 mM EGTA.After the buffer was formula...
In DepthDetails US Patent
TargetTyrosine-protein kinase JAK3(Homo sapiens (Human))
Guangzhou Salustier Biosciences
US Patent
LigandPNGBDBM488640(US10961228, Example Tofacitinib | US11414413, Exam...)
Affinity DataIC50:  0.720nM. Assay description: Kinase Assay:Preparation of buffers, the buffer included 50 mM HEPES (pH 7.5), 0.01% Brij-35, 10 mM MgCl2, and 1 mM EGTA.After the buffer was formula...
In DepthDetails US Patent
TargetTyrosine-protein kinase JAK1(Homo sapiens (Human))
Shanghai Longwood Biopharmaceuticals
US Patent
LigandPNGBDBM488640(US10961228, Example Tofacitinib | US11414413, Exam...)
Affinity DataIC50:  35nM. Assay description: The study of the effect of compounds on the activity of purified recombinant JAK was performed by studying the inhibitory activity of the compounds o...
In DepthDetails US Patent
TargetTyrosine-protein kinase JAK2(Homo sapiens (Human))
Shanghai Longwood Biopharmaceuticals
US Patent
LigandPNGBDBM488640(US10961228, Example Tofacitinib | US11414413, Exam...)
Affinity DataIC50:  35nM. Assay description: The study of the effect of compounds on the activity of purified recombinant JAK was performed by studying the inhibitory activity of the compounds o...
In DepthDetails US Patent
TargetTyrosine-protein kinase JAK3(Homo sapiens (Human))
Guangzhou Salustier Biosciences
US Patent
LigandPNGBDBM488640(US10961228, Example Tofacitinib | US11414413, Exam...)
Affinity DataIC50: <20nM. Assay description: The study of the effect of compounds on the activity of purified recombinant JAK was performed by studying the inhibitory activity of the compounds o...
In DepthDetails US Patent
TargetTyrosine-protein kinase JAK1(Homo sapiens (Human))
Shanghai Longwood Biopharmaceuticals
US Patent
LigandPNGBDBM488640(US10961228, Example Tofacitinib | US11414413, Exam...)
Affinity DataIC50:  6.62nM. Assay description: Test method: Firstly, test compounds were prepared into 10 mM stock solution with DMSO, and continuously diluted into 10 concentrations at a 3-fold g...
In DepthDetails US Patent
TargetTyrosine-protein kinase JAK2(Homo sapiens (Human))
Shanghai Longwood Biopharmaceuticals
US Patent
LigandPNGBDBM488640(US10961228, Example Tofacitinib | US11414413, Exam...)
Affinity DataIC50:  25.9nM. Assay description: Test method: Firstly, test compounds were prepared into 10 mM stock solution with DMSO, and continuously diluted into 10 concentrations at a 3-fold g...
In DepthDetails US Patent
TargetTyrosine-protein kinase JAK3(Homo sapiens (Human))
Guangzhou Salustier Biosciences
US Patent
LigandPNGBDBM488640(US10961228, Example Tofacitinib | US11414413, Exam...)
Affinity DataIC50:  3nM. Assay description: Test method: Firstly, test compounds were prepared into 10 mM stock solution with DMSO, and continuously diluted into 10 concentrations at a 3-fold g...
In DepthDetails US Patent
TargetNon-receptor tyrosine-protein kinase TYK2(Homo sapiens (Human))
Guangzhou Salustier Biosciences
US Patent
LigandPNGBDBM488640(US10961228, Example Tofacitinib | US11414413, Exam...)
Affinity DataIC50:  112nM. Assay description: Test method: Firstly, test compounds were prepared into 10 mM stock solution with DMSO, and continuously diluted into 10 concentrations at a 3-fold g...
In DepthDetails US Patent
TargetTyrosine-protein kinase JAK2 [831-1132](Homo sapiens (Human))
Astrazeneca
US Patent
LigandPNGBDBM488640(US10961228, Example Tofacitinib | US11414413, Exam...)
Affinity DataIC50:  130nM. Assay description: Enzyme inhibition studies were performed using recombinant JAK1 (amino acids 866-1154, Life Technologies, #PV4774, Carlsbad, Calif.), JAK2 (amino aci...
In DepthDetails US Patent