BDBM488763 (R)-2-((3R,5R)-3,5- dimethylpiperazin-1- yl)-N-(3-(5-fluoro-2- ((2-fluoro-3- (methylsulfonyl)phenyl) amino)pyrimidin-4- yl)-1H-indol-7- yl)butanamide::US10961228, Example 31
SMILES CC[C@@H](N1C[C@@H](C)N[C@H](C)C1)C(=O)Nc1cccc2c(c[nH]c12)-c1nc(Nc2cccc(c2F)S(C)(=O)=O)ncc1F
InChI Key
Data  3 IC50
  Tab Delimited (TSV)   2D SDfile   Computed 3D by Vconf -m prep SDfile
Find this compound or compounds like it in BindingDB:
Activity Spreadsheet -- Enzyme Inhibition Constant Data from BindingDB
Found 3 hits for monomerid = 488763
TargetTyrosine-protein kinase JAK1 [866-1154](Homo sapiens (Human))
Astrazeneca
US Patent
LigandPNGBDBM488763((R)-2-((3R,5R)-3,5- dimethylpiperazin-1- yl)-N-(3-...)
Affinity DataIC50:  6.40nM. Assay description: Enzyme inhibition studies were performed using recombinant JAK1 (amino acids 866-1154, Life Technologies, #PV4774, Carlsbad, Calif.), JAK2 (amino aci...
Ligand InfoPC cidPC sid
In DepthDetails US Patent
TargetTyrosine-protein kinase JAK3 [781-1124](Homo sapiens (Human))
Astrazeneca
US Patent
LigandPNGBDBM488763((R)-2-((3R,5R)-3,5- dimethylpiperazin-1- yl)-N-(3-...)
Affinity DataIC50: >3.00E+4nM. Assay description: Enzyme inhibition studies were performed using recombinant JAK1 (amino acids 866-1154, Life Technologies, #PV4774, Carlsbad, Calif.), JAK2 (amino aci...
Ligand InfoPC cidPC sid
In DepthDetails US Patent
TargetTyrosine-protein kinase JAK2 [831-1132](Homo sapiens (Human))
Astrazeneca
US Patent
LigandPNGBDBM488763((R)-2-((3R,5R)-3,5- dimethylpiperazin-1- yl)-N-(3-...)
Affinity DataIC50:  1.79E+3nM. Assay description: Enzyme inhibition studies were performed using recombinant JAK1 (amino acids 866-1154, Life Technologies, #PV4774, Carlsbad, Calif.), JAK2 (amino aci...
Ligand InfoPC cidPC sid
In DepthDetails US Patent