BDBM489310 Example 5-2::US10961242, Compound 27::US11548883, Compound 27
SMILES O=C(CN1CCN(CC1)c1cnc(NC2Cc3ccccc3C2)nc1)Nc1ccc2[nH]c(=O)oc2c1
InChI Key InChIKey=JQMFQLVAJGZSQS-UHFFFAOYSA-N
Data  2 IC50
  Tab Delimited (TSV)   2D SDfile   Computed 3D by Vconf -m prep SDfile
Find this compound or compounds like it in BindingDB:
Activity Spreadsheet -- Enzyme Inhibition Constant Data from BindingDB
Found 2 hits for monomerid = 489310
TargetEctonucleotide pyrophosphatase/phosphodiesterase family member 2(Homo sapiens (Human))
Legochem Biosciences
US Patent
LigandPNGBDBM489310(Example 5-2 | US10961242, Compound 27 | US11548883...)
Affinity DataIC50:  2.40nM. Assay description: Two-fold dilution of each test compound solution (10 μM, 100% dimethyl sulfoxide) is carried out on 96-well V bottom plate (Costar 3363). After ...
Ligand InfoPC cidPC sid
In DepthDetails US Patent
TargetEctonucleotide pyrophosphatase/phosphodiesterase family member 2(Homo sapiens (Human))
Legochem Biosciences
US Patent
LigandPNGBDBM489310(Example 5-2 | US10961242, Compound 27 | US11548883...)
Affinity DataIC50:  2.40nM. Assay description: Two-fold dilution of each test compound solution (10 μM, 100% dimethyl sulfoxide) is carried out on 96-well V bottom plate (Costar 3363). After ...
Ligand InfoPC cidPC sid
In DepthDetails US Patent