BDBM489332 2-(5-{2-[(2,3-dihydro-1H-inden-2-yl)amino]pyrimidin-5-yl}-1,3,4-oxadiazol-2-yl)-1-{1H,4H,5H,6H,7H-pyrazolo[4,3-c]pyridin-5-yl}ethan-1-one::Example 7-3::US10961242, Compound 53::US10961242, Compound 63::US11548883, Compound 53
SMILES O=C(Cn1ccc(n1)-c1cnc(NC2Cc3ccccc3C2)nc1)N1CCc2[nH]nnc2C1
InChI Key InChIKey=XEXYJYUTXVEJKJ-UHFFFAOYSA-N
Data  3 IC50
  Tab Delimited (TSV)   2D SDfile   Computed 3D by Vconf -m prep SDfile
Find this compound or compounds like it in BindingDB:
Activity Spreadsheet -- Enzyme Inhibition Constant Data from BindingDB
Found 3 hits for monomerid = 489332
TargetEctonucleotide pyrophosphatase/phosphodiesterase family member 2(Homo sapiens (Human))
Legochem Biosciences
US Patent
LigandPNGBDBM489332( 2-(5-{2-[(2,3-dihydro-1H-inden-2-yl)amino]pyrimid...)
Affinity DataIC50:  3.10nM. Assay description: Two-fold dilution of each test compound solution (10 μM, 100% dimethyl sulfoxide) is carried out on 96-well V bottom plate (Costar 3363). After ...
Ligand InfoPC cidPC sid
In DepthDetails US Patent
TargetEctonucleotide pyrophosphatase/phosphodiesterase family member 2(Homo sapiens (Human))
Legochem Biosciences
US Patent
LigandPNGBDBM489332( 2-(5-{2-[(2,3-dihydro-1H-inden-2-yl)amino]pyrimid...)
Affinity DataIC50:  3.10nM. Assay description: Two-fold dilution of each test compound solution (10 μM, 100% dimethyl sulfoxide) is carried out on 96-well V bottom plate (Costar 3363). After ...
Ligand InfoPC cidPC sid
In DepthDetails US Patent
TargetEctonucleotide pyrophosphatase/phosphodiesterase family member 2(Homo sapiens (Human))
Legochem Biosciences
US Patent
LigandPNGBDBM489332( 2-(5-{2-[(2,3-dihydro-1H-inden-2-yl)amino]pyrimid...)
Affinity DataIC50:  2nM. Assay description: Two-fold dilution of each test compound solution (10 μM, 100% dimethyl sulfoxide) is carried out on 96-well V bottom plate (Costar 3363). After ...
Ligand InfoPC cidPC sid
In DepthDetails US Patent