BDBM489353 Example 10-10::US10961242, Compound 70::US11548883, Compound 70
SMILES CCN1CCC(CC1)Oc1nn(CC(=O)N2CCc3[nH]nnc3C2)cc1-c1cnc(NC2Cc3ccccc3C2)nc1
InChI Key InChIKey=VPSXHKGJZJCWLV-UHFFFAOYSA-N
Data  2 IC50
  Tab Delimited (TSV)   2D SDfile   Computed 3D by Vconf -m prep SDfile
Find this compound or compounds like it in BindingDB:
Activity Spreadsheet -- Enzyme Inhibition Constant Data from BindingDB
Found 2 hits for monomerid = 489353
TargetEctonucleotide pyrophosphatase/phosphodiesterase family member 2(Homo sapiens (Human))
Legochem Biosciences
US Patent
LigandPNGBDBM489353(Example 10-10 | US10961242, Compound 70 | US115488...)
Affinity DataIC50:  2.30nM. Assay description: Two-fold dilution of each test compound solution (10 μM, 100% dimethyl sulfoxide) is carried out on 96-well V bottom plate (Costar 3363). After ...
Ligand InfoPC cidPC sid
In DepthDetails US Patent
TargetEctonucleotide pyrophosphatase/phosphodiesterase family member 2(Homo sapiens (Human))
Legochem Biosciences
US Patent
LigandPNGBDBM489353(Example 10-10 | US10961242, Compound 70 | US115488...)
Affinity DataIC50:  2.30nM. Assay description: Two-fold dilution of each test compound solution (10 μM, 100% dimethyl sulfoxide) is carried out on 96-well V bottom plate (Costar 3363). After ...
Ligand InfoPC cidPC sid
In DepthDetails US Patent