BDBM49006 1-methoxypropan-2-yl 2-amino-1-(3-methoxypropyl)pyrrolo[3,2-b]quinoxaline-3-carboxylate::1-methoxypropan-2-yl 2-azanyl-1-(3-methoxypropyl)pyrrolo[3,2-b]quinoxaline-3-carboxylate::2-amino-1-(3-methoxypropyl)-3-pyrrolo[3,2-b]quinoxalinecarboxylic acid 1-methoxypropan-2-yl ester::2-amino-1-(3-methoxypropyl)pyrrolo[3,2-b]quinoxaline-3-carboxylic acid (2-methoxy-1-methyl-ethyl) ester::MLS000078651::SMR000041454::cid_660685
SMILES COCCCn1c(N)c(C(=O)OC(C)COC)c2nc3ccccc3nc12
InChI Key InChIKey=CBAORSDJTYTFGR-UHFFFAOYSA-N
Data  2 EC50
  Tab Delimited (TSV)   2D SDfile   Computed 3D by Vconf -m prep SDfile
Find this compound or compounds like it in BindingDB:
Activity Spreadsheet -- Enzyme Inhibition Constant Data from BindingDB
Found 2 hits for monomerid = 49006
TargetImportin subunit alpha-1(Homo sapiens (Human))
Broad Institute
Curated by PubChem BioAssay
LigandPNGBDBM49006(1-methoxypropan-2-yl 2-amino-1-(3-methoxypropyl)py...)
Affinity DataEC50:  2.67E+4nM. Assay description: Keywords: Counterscreen, FRET assay, HTS, YIC probe, Dose response, Assay Overview: This is a fluorescence resonance energy transfer (FRET)-based b...
In DepthDetails PCBioAssay
TargetD(1A) dopamine receptor(Homo sapiens (Human))
Vanderbilt Screening Center For Gpcrs, Ion Channels and Transporters
Curated by PubChem BioAssay
LigandPNGBDBM49006(1-methoxypropan-2-yl 2-amino-1-(3-methoxypropyl)py...)
Affinity DataEC50:  0.00352nM. Assay description: Assay Provider: Val Watts Assay Provider Affiliation: Purdue University Grant Title: Allosteric Modulators of D1 Receptors Grant Number: 1 X01 MH0776...
In DepthDetails PCBioAssay