BDBM49031 2-[5-(furan-2-yl)-4-oxidanylidene-3-phenyl-thieno[2,3-d]pyrimidin-2-yl]sulfanylethanamide::2-[5-(furan-2-yl)-4-oxo-3-phenylthieno[2,3-d]pyrimidin-2-yl]sulfanylacetamide::2-[[5-(2-furanyl)-4-oxo-3-phenyl-2-thieno[2,3-d]pyrimidinyl]thio]acetamide::2-[[5-(2-furyl)-4-keto-3-phenyl-thieno[2,3-d]pyrimidin-2-yl]thio]acetamide::MLS000057991::SMR000063032::cid_2077582
SMILES NC(=O)CSc1nc2scc(-c3ccco3)c2c(=O)n1-c1ccccc1
InChI Key InChIKey=VKKAQVCKUDHOFN-UHFFFAOYSA-N
Data  1 EC50
  Tab Delimited (TSV)   2D SDfile   Computed 3D by Vconf -m prep SDfile
Find this compound or compounds like it in BindingDB:
Activity Spreadsheet -- Enzyme Inhibition Constant Data from BindingDB
Found 1 hit for monomerid = 49031
TargetD(1A) dopamine receptor(Homo sapiens (Human))
Vanderbilt Screening Center For Gpcrs, Ion Channels and Transporters
Curated by PubChem BioAssay
LigandPNGBDBM49031(2-[5-(furan-2-yl)-4-oxidanylidene-3-phenyl-thieno[...)
Affinity DataEC50:  0.00163nM. Assay description: Assay Provider: Val Watts Assay Provider Affiliation: Purdue University Grant Title: Allosteric Modulators of D1 Receptors Grant Number: 1 X01 MH0776...
In DepthDetails PCBioAssay