BDBM49327 2-(2,4-dichlorophenyl)-5-(prop-2-enylthio)-1,3,4-oxadiazole::2-(2,4-dichlorophenyl)-5-prop-2-enylsulfanyl-1,3,4-oxadiazole::2-(allylthio)-5-(2,4-dichlorophenyl)-1,3,4-oxadiazole::MLS000106052::SMR000103023::cid_1731558
SMILES Clc1ccc(-c2nnc(SCC=C)o2)c(Cl)c1
InChI Key InChIKey=KXMZHKSMSJHVKB-UHFFFAOYSA-N
Data  3 IC50  1 EC50
  Tab Delimited (TSV)   2D SDfile   Computed 3D by Vconf -m prep SDfile
Find this compound or compounds like it in BindingDB:
Activity Spreadsheet -- Enzyme Inhibition Constant Data from BindingDB
Found 4 hits for monomerid = 49327
TargetTranscription factor p65(Homo sapiens (Human))
Srmlsc
Curated by PubChem BioAssay
LigandPNGBDBM49327(2-(2,4-dichlorophenyl)-5-(prop-2-enylthio)-1,3,4-o...)
Affinity DataEC50:  4.37E+3nM. Assay description: Southern Research Molecular Libraries Screening Center (SRMLSC) Southern Research Institute (Birmingham, Alabama) NIH Molecular Libraries Screening C...
In DepthDetails PCBioAssay
TargetHeat shock protein hsp-16.2(Caenorhabditis elegans)
Burnham Center For Chemical Genomics
Curated by PubChem BioAssay
LigandPNGBDBM49327(2-(2,4-dichlorophenyl)-5-(prop-2-enylthio)-1,3,4-o...)
Affinity DataIC50:  4.41E+4nM
In DepthDetails PCBioAssay
TargetProtein skinhead-1(Caenorhabditis elegans)
Burnham Center For Chemical Genomics
Curated by PubChem BioAssay
LigandPNGBDBM49327(2-(2,4-dichlorophenyl)-5-(prop-2-enylthio)-1,3,4-o...)
Affinity DataIC50:  2.52E+4nM
In DepthDetails PCBioAssay
TargetE3 ubiquitin-protein ligase XIAP(Homo sapiens (Human))
Sanford-Burnham Center For Chemical Genomics
Curated by PubChem BioAssay
LigandPNGBDBM49327(2-(2,4-dichlorophenyl)-5-(prop-2-enylthio)-1,3,4-o...)
Affinity DataIC50:  1.00E+5nM. Assay description: Data Source: Sanford-Burnham Center for Chemical Genomics (SBCCG) Source Affiliation: Sanford-Burnham Medical Research Institute (SBMRI, San Diego, C...
In DepthDetails PCBioAssay