BDBM50001491 3-Butyl-3,7-dihydro-purine-2,6-dione::CHEMBL334849
SMILES CCCCn1c2nc[nH]c2c(=O)[nH]c1=O
InChI Key InChIKey=RDIDOICNEQWODO-UHFFFAOYSA-N
Data  2 KI  1 EC50
  Tab Delimited (TSV)   2D SDfile   Computed 3D by Vconf -m prep SDfile
Find this compound or compounds like it in BindingDB:
Activity Spreadsheet -- Enzyme Inhibition Constant Data from BindingDB
Found 3 hits for monomerid = 50001491
TargetAdenosine receptor A1(GUINEA PIG)
Hokuriku University
Curated by ChEMBL
LigandPNGBDBM50001491(3-Butyl-3,7-dihydro-purine-2,6-dione | CHEMBL33484...)
Affinity DataKi:  2.14E+4nM. Assay description: Affinity against adenosine A1 receptor in the brain membranes by the displacement of [3H]-CPX.
In DepthDetails ArticlePubMed
TargetcAMP-specific 3',5'-cyclic phosphodiesterase 4A/4B/4C/4D(Homo sapiens (Human))
Hokuriku University
Curated by ChEMBL
LigandPNGBDBM50001491(3-Butyl-3,7-dihydro-purine-2,6-dione | CHEMBL33484...)
Affinity DataKi:  3.20E+4nM. Assay description: Inhibition of c-AMP phosphodiesterase activity in guinea pig tracheal muscle
In DepthDetails ArticlePubMed
TargetAdenosine receptor A2a(Homo sapiens (Human))
Hokuriku University
Curated by ChEMBL
LigandPNGBDBM50001491(3-Butyl-3,7-dihydro-purine-2,6-dione | CHEMBL33484...)
Affinity DataEC50:  8.30E+3nM. Assay description: Relexant activity on the spontaneous tone of isolated guinea pig tracheal ring chains.
In DepthDetails ArticlePubMed