BDBM50004709 CHEMBL2269031
SMILES Cc1ccn2nc(nc2n1)S(=O)(=O)Nc1c(Br)ccc2cccnc12
InChI Key InChIKey=RIUIWENFMORKOV-UHFFFAOYSA-N
Data  1 IC50
  Tab Delimited (TSV)   2D SDfile   Computed 3D by Vconf -m prep SDfile
Find this compound or compounds like it in BindingDB:
Activity Spreadsheet -- Enzyme Inhibition Constant Data from BindingDB
Found 1 hit for monomerid = 50004709
TargetAcetolactate synthase 2, chloroplastic(Nicotiana tabacum)
Seoul Women'S University
Curated by ChEMBL
LigandPNGBDBM50004709(CHEMBL2269031)
Affinity DataIC50:  19nM. Assay description: Inhibition of wild type Nicotiana tabacum (tobacco) GST-tagged acetolactate synthase expressed in Escherichia coli by modified Westerfeld method
In DepthDetails ArticlePubMed