BDBM50009775 (3-Benzothiazol-2-ylmethyl-4-oxo-6-trifluoromethyl-3,4-dihydro-phthalazin-1-yl)-acetic acid::CHEMBL20693
SMILES OC(=O)Cc1nn(Cc2nc3ccccc3s2)c(=O)c2cc(ccc12)C(F)(F)F
InChI Key InChIKey=UIRKEJYPYSAKRR-UHFFFAOYSA-N
Data  1 IC50
  Tab Delimited (TSV)   2D SDfile   Computed 3D by Vconf -m prep SDfile
Find this compound or compounds like it in BindingDB:
Activity Spreadsheet -- Enzyme Inhibition Constant Data from BindingDB
Found 1 hit for monomerid = 50009775
TargetAldo-keto reductase family 1 member B1(Homo sapiens (Human))
Pfizer
Curated by ChEMBL
LigandPNGBDBM50009775((3-Benzothiazol-2-ylmethyl-4-oxo-6-trifluoromethyl...)
Affinity DataIC50:  12nM. Assay description: Inhibition of aldose reductase (aldo-keto reductase, AKR1B1) isolated from human placenta.
In DepthDetails ArticlePubMed