BDBM50011829 1-Methyl-3-propyl-8-pyridin-4-yl-3,7-dihydro-purine-2,6-dione::CHEMBL33762
SMILES CCCn1c2nc([nH]c2c(=O)n(C)c1=O)-c1ccncc1
InChI Key InChIKey=GHWWVZMSEQVHCK-UHFFFAOYSA-N
Data  2 KI
  Tab Delimited (TSV)   2D SDfile   Computed 3D by Vconf -m prep SDfile
Find this compound or compounds like it in BindingDB:
Activity Spreadsheet -- Enzyme Inhibition Constant Data from BindingDB
Found 2 hits for monomerid = 50011829
TargetAdenosine receptor A1(Rattus norvegicus (rat))
Nova Pharmaceutical
Curated by ChEMBL
LigandPNGBDBM50011829(1-Methyl-3-propyl-8-pyridin-4-yl-3,7-dihydro-purin...)
Affinity DataKi:  22nM. Assay description: Binding affinity against adenosine A1 receptor in rat cortex by the displacement of [3H]-cyclohexyladenosine (CHA).
In DepthDetails ArticlePubMed
TargetAdenosine receptor A2a/A2b(Rattus norvegicus)
Nova Pharmaceutical
Curated by ChEMBL
LigandPNGBDBM50011829(1-Methyl-3-propyl-8-pyridin-4-yl-3,7-dihydro-purin...)
Affinity DataKi:  476nM. Assay description: Binding affinity against adenosine A2 receptor in rat striatum by the displacement of [3H]N-ethyladenosine-5''-uronamide(NECA).
In DepthDetails ArticlePubMed