BDBM50011845 4-(3-Methyl-2,6-dioxo-1-propyl-2,3,6,7-tetrahydro-1H-purin-8-yl)-benzonitrile::CHEMBL34784
SMILES CCCn1c(=O)n(C)c2nc([nH]c2c1=O)-c1ccc(cc1)C#N
InChI Key InChIKey=DWDAAVQEWYIRTC-UHFFFAOYSA-N
Data  2 KI
  Tab Delimited (TSV)   2D SDfile   Computed 3D by Vconf -m prep SDfile
Find this compound or compounds like it in BindingDB:
Activity Spreadsheet -- Enzyme Inhibition Constant Data from BindingDB
Found 2 hits for monomerid = 50011845
TargetAdenosine receptor A1(Rattus norvegicus (rat))
Nova Pharmaceutical
Curated by ChEMBL
LigandPNGBDBM50011845(4-(3-Methyl-2,6-dioxo-1-propyl-2,3,6,7-tetrahydro-...)
Affinity DataKi:  6nM. Assay description: Binding affinity against adenosine A1 receptor in rat cortex by the displacement of [3H]-cyclohexyladenosine (CHA).
In DepthDetails ArticlePubMed
TargetAdenosine receptor A2a/A2b(Rattus norvegicus)
Nova Pharmaceutical
Curated by ChEMBL
LigandPNGBDBM50011845(4-(3-Methyl-2,6-dioxo-1-propyl-2,3,6,7-tetrahydro-...)
Affinity DataKi:  446nM. Assay description: Binding affinity against adenosine A2 receptor in rat striatum by the displacement of [3H]N-ethyladenosine-5''-uronamide(NECA).
In DepthDetails ArticlePubMed