BDBM50011848 3-Methyl-1-propyl-8-thiophen-2-yl-3,7-dihydro-purine-2,6-dione::CHEMBL33893
SMILES CCCn1c(=O)n(C)c2nc([nH]c2c1=O)-c1cccs1
InChI Key InChIKey=JJDAVUXSFNKXTP-UHFFFAOYSA-N
Data  2 KI
  Tab Delimited (TSV)   2D SDfile   Computed 3D by Vconf -m prep SDfile
Find this compound or compounds like it in BindingDB:
Activity Spreadsheet -- Enzyme Inhibition Constant Data from BindingDB
Found 2 hits for monomerid = 50011848
TargetAdenosine receptor A1(Rattus norvegicus (rat))
Nova Pharmaceutical
Curated by ChEMBL
LigandPNGBDBM50011848(3-Methyl-1-propyl-8-thiophen-2-yl-3,7-dihydro-puri...)
Affinity DataKi:  9.70nM. Assay description: Binding affinity against Adenosine A1 receptor in rat cortex by displacement of [3H]-cyclohexyladenosine (CHA)
In DepthDetails ArticlePubMed
TargetAdenosine receptor A2a/A2b(Rattus norvegicus)
Nova Pharmaceutical
Curated by ChEMBL
LigandPNGBDBM50011848(3-Methyl-1-propyl-8-thiophen-2-yl-3,7-dihydro-puri...)
Affinity DataKi:  719nM. Assay description: Binding affinity against Adenosine A2 receptor in rat striatum by displacement of [3H]N-ethyladenosine-5''-uronamide(NECA)
In DepthDetails ArticlePubMed