BDBM50011849 1,3-Dipropyl-8-pyridin-3-yl-3,7-dihydro-purine-2,6-dione::CHEMBL287010
SMILES CCCn1c2nc([nH]c2c(=O)n(CCC)c1=O)-c1cccnc1
InChI Key InChIKey=OLTGZKBENYFNAC-UHFFFAOYSA-N
Data  2 KI
  Tab Delimited (TSV)   2D SDfile   Computed 3D by Vconf -m prep SDfile
Find this compound or compounds like it in BindingDB:
Activity Spreadsheet -- Enzyme Inhibition Constant Data from BindingDB
Found 2 hits for monomerid = 50011849
TargetAdenosine receptor A1(Rattus norvegicus (rat))
Nova Pharmaceutical
Curated by ChEMBL
LigandPNGBDBM50011849(1,3-Dipropyl-8-pyridin-3-yl-3,7-dihydro-purine-2,6...)
Affinity DataKi:  12nM. Assay description: Binding affinity against Adenosine A1 receptor in rat cortex by displacement of [3H]-cyclohexyladenosine (CHA)
In DepthDetails ArticlePubMed
TargetAdenosine receptor A2a/A2b(Rattus norvegicus)
Nova Pharmaceutical
Curated by ChEMBL
LigandPNGBDBM50011849(1,3-Dipropyl-8-pyridin-3-yl-3,7-dihydro-purine-2,6...)
Affinity DataKi:  347nM. Assay description: Binding affinity against Adenosine A2 receptor in rat striatum by displacement of [3H]N-ethyladenosine-5''-uronamide(NECA)
In DepthDetails ArticlePubMed