BDBM50015239 CHEMBL3262755
SMILES COc1ccc(cc1)C(=O)NC(CC(=O)N[C@@H](Cc1ccccc1)C(=O)N[C@@H](CC(C)C)C(=O)[C@@]1(C)CO1)c1ccccc1
InChI Key InChIKey=MSGIVAIQQQASIZ-WGCUALRVSA-N
Data  1 IC50
  Tab Delimited (TSV)   2D SDfile   Computed 3D by Vconf -m prep SDfile
Find this compound or compounds like it in BindingDB:
Activity Spreadsheet -- Enzyme Inhibition Constant Data from BindingDB
Found 1 hit for monomerid = 50015239
TargetProteasome subunit beta type-7(Homo sapiens (Human))
Zhejiang University
Curated by ChEMBL
LigandPNGBDBM50015239(CHEMBL3262755)
Affinity DataIC50:  340nM. Assay description: Inhibition of chymotrypsin-like enzyme activity of purified human 20S proteasome using Suc-Leu-Leu-Val-Tyr-AMC as substrate by fluorescence method
In DepthDetails ArticlePubMed