BDBM50018055 7-Amino-heptan-2-one::CHEMBL176843
SMILES CC(=O)CCCCCN
InChI Key InChIKey=JHYBLGGRROSXDF-UHFFFAOYSA-N
Data  1 KI
  Tab Delimited (TSV)   2D SDfile   Computed 3D by Vconf -m prep SDfile
Find this compound or compounds like it in BindingDB:
Activity Spreadsheet -- Enzyme Inhibition Constant Data from BindingDB
Found 1 hit for monomerid = 50018055
TargetPeroxisomal N(1)-acetyl-spermine/spermidine oxidase(Homo sapiens (Human))
University Of The Pacific
Curated by ChEMBL
LigandPNGBDBM50018055(7-Amino-heptan-2-one | CHEMBL176843)
Affinity DataKi:  2.20E+3nM. Assay description: Inhibition of deacetylation of [acetyl-3H]-N8-Acetylspermidine deacetylase in rat liver
In DepthDetails ArticlePubMed