BDBM50019128 CHEMBL3288423
SMILES COc1ccnc2n(c(CCn3c4nccnc4n(C)c3=O)nc12)-c1ccccc1
InChI Key InChIKey=KDNTXPYKAVUAQU-UHFFFAOYSA-N
Data  1 IC50
  Tab Delimited (TSV)   2D SDfile   Computed 3D by Vconf -m prep SDfile
Find this compound or compounds like it in BindingDB:
Activity Spreadsheet -- Enzyme Inhibition Constant Data from BindingDB
Found 1 hit for monomerid = 50019128
TargetcAMP and cAMP-inhibited cGMP 3',5'-cyclic phosphodiesterase 10A(Homo sapiens (Human))
Yamanouchi Pharmaceutical
Curated by ChEMBL
LigandPNGBDBM50019128(CHEMBL3288423)
Affinity DataIC50:  111nM. Assay description: Inhibition of human recombinant PDE10A expressed in Sf9 insect cell system assessed as inhibition of cAMP hydrolysis preincubated for 30 mins before ...
In DepthDetails ArticlePubMed