BDBM50019800 CHEMBL3286890
SMILES C(Oc1ccc(cc1)-c1nc2ccccc2n1Cc1ccccc1)C(C1CCCNC1)n1c(nc2ccccc12)-c1ccccc1
InChI Key InChIKey=XFKBTTLKRPNYMX-UHFFFAOYSA-N
Data  2 Kd
  Tab Delimited (TSV)   2D SDfile   Computed 3D by Vconf -m prep SDfile
Find this compound or compounds like it in BindingDB:
Activity Spreadsheet -- Enzyme Inhibition Constant Data from BindingDB
Found 2 hits for monomerid = 50019800
TargetRetinal rod rhodopsin-sensitive cGMP 3',5'-cyclic phosphodiesterase subunit delta(Homo sapiens (Human))
Max Planck Institute Of Molecular Physiology
Curated by ChEMBL
LigandPNGBDBM50019800(CHEMBL3286890)
Affinity DataKd:  207nM. Assay description: Binding affinity to His6-tagged PDE-delta (unknown origin) measured every 3 mins by fluorescence polarization assay
In DepthDetails ArticlePubMed
TargetRetinal rod rhodopsin-sensitive cGMP 3',5'-cyclic phosphodiesterase subunit delta(Homo sapiens (Human))
Max Planck Institute Of Molecular Physiology
Curated by ChEMBL
LigandPNGBDBM50019800(CHEMBL3286890)
Affinity DataKd: >400nM. Assay description: Binding affinity to His6-tagged PDE-delta (unknown origin) measured every 3 mins by fluorescence polarization assay
In DepthDetails ArticlePubMed