BDBM50019820 CHEMBL3286901
SMILES Fc1cccc(Cl)c1Cn1c(nc2ccccc12)N1CCC(CC1)C(=O)OCC(C1CCCCC1)n1c(nc2ccccc12)-c1ccccc1
InChI Key InChIKey=YKSWAAHSHPVWLU-UHFFFAOYSA-N
Data  1 Kd
  Tab Delimited (TSV)   2D SDfile   Computed 3D by Vconf -m prep SDfile
Find this compound or compounds like it in BindingDB:
Activity Spreadsheet -- Enzyme Inhibition Constant Data from BindingDB
Found 1 hit for monomerid = 50019820
TargetRetinal rod rhodopsin-sensitive cGMP 3',5'-cyclic phosphodiesterase subunit delta(Homo sapiens (Human))
Max Planck Institute Of Molecular Physiology
Curated by ChEMBL
LigandPNGBDBM50019820(CHEMBL3286901)
Affinity DataKd:  115nM. Assay description: Binding affinity to His6-tagged PDE-delta (unknown origin) measured every 3 mins by fluorescence polarization assay
In DepthDetails ArticlePubMed