BDBM50020973 1,3-Diethyl-8-[4-(4-methyl-piperazine-1-sulfonyl)-phenyl]-3,7-dihydro-purine-2,6-dione::CHEMBL11049
SMILES CCn1c2nc([nH]c2c(=O)n(CC)c1=O)-c1ccc(cc1)S(=O)(=O)N1CCN(C)CC1
InChI Key InChIKey=DBKFUHXRVQFACP-UHFFFAOYSA-N
Data  2 IC50
  Tab Delimited (TSV)   2D SDfile   Computed 3D by Vconf -m prep SDfile
Find this compound or compounds like it in BindingDB:
Activity Spreadsheet -- Enzyme Inhibition Constant Data from BindingDB
Found 2 hits for monomerid = 50020973
TargetAdenosine receptor A1(BOVINE)
TBA
Curated by ChEMBL
LigandPNGBDBM50020973(1,3-Diethyl-8-[4-(4-methyl-piperazine-1-sulfonyl)-...)
Affinity DataIC50:  6.5nM. Assay description: Binding affinity against bovine brain adenosine A1 receptor by using N6-[3H]- cyclohexyladenosineChecked by Author
In DepthDetails ArticlePubMed
TargetAdenosine receptor A1(Rattus norvegicus (rat))
TBA
Curated by ChEMBL
LigandPNGBDBM50020973(1,3-Diethyl-8-[4-(4-methyl-piperazine-1-sulfonyl)-...)
Affinity DataIC50:  190nM. Assay description: Binding affinity against rat brain adenosine A1 receptor by using N6-[3H]- cyclohexyladenosine as radioligandChecked by Author
In DepthDetails ArticlePubMed