BDBM50021284 CHEMBL3287917
SMILES Cc1nc(c(C)c(-c2ccc3OCCCc3c2)c1[C@H](OC(C)(C)C)C(O)=O)-c1cccc(c1)-c1cnn(C)c1
InChI Key InChIKey=PMDBBHBNIHVBEJ-PMERELPUSA-N
Data  1 Kd
  Tab Delimited (TSV)   2D SDfile   Computed 3D by Vconf -m prep SDfile
Find this compound or compounds like it in BindingDB:
Activity Spreadsheet -- Enzyme Inhibition Constant Data from BindingDB
Found 1 hit for monomerid = 50021284
TargetIntegrase(Human immunodeficiency virus 1)
Boehringer Ingelheim (Canada)
Curated by ChEMBL
LigandPNGBDBM50021284(CHEMBL3287917)
Affinity DataKd:  59nM. Assay description: Apparent binding affinity to Trx-His-tagged HIV integrase
In DepthDetails ArticlePubMed