BDBM50023976 (R)-2-[(2,2-Dimethyl-cyclopropanecarbonyl)-amino]-oct-2-enoic acid::(S)-2-[(2,2-Dimethyl-cyclopropanecarbonyl)-amino]-oct-2-enoic acid::2-[(2,2-Dimethyl-cyclopropanecarbonyl)-amino]-oct-2-enoic acid::CHEMBL428006
SMILES CCCCC\C=C(/NC(=O)C1CC1(C)C)C(O)=O
InChI Key InChIKey=WIESNNVNXBYTFK-FLIBITNWSA-N
Data  1 KI
  Tab Delimited (TSV)   2D SDfile   Computed 3D by Vconf -m prep SDfile
Find this compound or compounds like it in BindingDB:
Activity Spreadsheet -- Enzyme Inhibition Constant Data from BindingDB
Found 1 hit for monomerid = 50023976
TargetDipeptidase 1(GUINEA PIG)
TBA
Curated by ChEMBL
LigandPNGBDBM50023976((R)-2-[(2,2-Dimethyl-cyclopropanecarbonyl)-amino]-...)
Affinity DataKi:  170nM. Assay description: Inhibitory activity against beta-lactamase renal dipeptidase
In DepthDetails ArticlePubMed