BDBM50031635 CHEMBL3359786
SMILES [O-]C=O.CC(C)[C@H](NC(=O)[C@H](C)NC(=O)[C@@H](NC(=O)C1CC[N+](C)(C)CC1)C(C)(C)C)C(=O)C(=O)NCc1ccccc1
InChI Key InChIKey=NYPGUDOIKBWOES-GRYUFTJMSA-O
Data  2 IC50
  Tab Delimited (TSV)   2D SDfile   Computed 3D by Vconf -m prep SDfile
Find this compound or compounds like it in BindingDB:
Activity Spreadsheet -- Enzyme Inhibition Constant Data from BindingDB
Found 2 hits for monomerid = 50031635
TargetCathepsin B(Homo sapiens (Human))
Domainex
Curated by ChEMBL
LigandPNGBDBM50031635(CHEMBL3359786)
Affinity DataIC50:  274nM. Assay description: Inhibition of human liver cathepsin B using ABz-Gly-Ile-Val-Arg-Ala-Lys-DNP-OH as substrate after 10 mins by fluorescence assay
In DepthDetails ArticlePubMed
TargetPeptidase 1(Dermatophagoides pteronyssinus (European house dus...)
Domainex
Curated by ChEMBL
LigandPNGBDBM50031635(CHEMBL3359786)
Affinity DataIC50:  6nM. Assay description: Inhibition of house dust mite Derp-1 after 20 mins
In DepthDetails ArticlePubMed