BDBM50033759 7-{3-[3-Methoxy-4-(2-methylsulfanyl-thiazol-4-yl)-2-propyl-phenoxy]-propoxy}-8-propyl-chroman-2-carboxylic acid::CHEMBL171780
SMILES CCCc1c(OCCCOc2ccc3CCC(Oc3c2CCC)C(O)=O)ccc(-c2csc(SC)n2)c1OC
InChI Key InChIKey=MUCFSURAOMWHPO-UHFFFAOYSA-N
Data  1 IC50
  Tab Delimited (TSV)   2D SDfile   Computed 3D by Vconf -m prep SDfile
Find this compound or compounds like it in BindingDB:
Activity Spreadsheet -- Enzyme Inhibition Constant Data from BindingDB
Found 1 hit for monomerid = 50033759
TargetLeukotriene B4 receptor 1(Homo sapiens (Human))
Searle Research And Development
Curated by ChEMBL
LigandPNGBDBM50033759(7-{3-[3-Methoxy-4-(2-methylsulfanyl-thiazol-4-yl)-...)
Affinity DataIC50:  2.80E+3nM. Assay description: Binding affinity for Leukotriene B4 (LTB4) receptor
In DepthDetails ArticlePubMed