BDBM50037121 2-[(1R,3S,4S)-1-BENZYL-4-[N-(BENZYLOXYCARBONYL)-L-VALYL]AMINO-3-PHENYLPENTYL]-4(5)-(2-METHYLPROPIONYL)IMIDAZOLE::CHEMBL326473::{(S)-1-[(1S,2S,4R)-1-Benzyl-2-hydroxy-4-(5-isobutyryl-1H-imidazol-2-yl)-5-phenyl-pentylcarbamoyl]-2-methyl-propyl}-carbamic acid benzyl ester
SMILES CC(C)[C@H](NC(=O)OCc1ccccc1)C(=O)N[C@@H](Cc1ccccc1)[C@@H](O)C[C@@H](Cc1ccccc1)c1ncc([nH]1)C(=O)C(C)C
InChI Key InChIKey=RQAVEWKEUKIFLD-LVPKLHHISA-N
Data  1 KI
PDB links: 1 PDB ID matches this monomer.
  Tab Delimited (TSV)   2D SDfile   Computed 3D by Vconf -m prep SDfile
Find this compound or compounds like it in BindingDB:
Activity Spreadsheet -- Enzyme Inhibition Constant Data from BindingDB
Found 1 hit for monomerid = 50037121
TargetGag-Pol polyprotein [489-587](Human immunodeficiency virus type 1)
Smithkline Beecham Pharmaceuticals
Curated by ChEMBL
LigandPNGBDBM50037121(2-[(1R,3S,4S)-1-BENZYL-4-[N-(BENZYLOXYCARBONYL)-L-...)
Affinity DataKi:  0.600nM. Assay description: Apparent inhibition constant against recombinant HIV-1 protease