BDBM50048989 3-(6,11-Dihydro-dibenzo[b,e]oxepin-2-yl)-N-hydroxy-N-methyl-propionamide::CHEMBL82680
SMILES CN(O)C(=O)CCc1ccc2OCc3ccccc3Cc2c1
InChI Key InChIKey=YGAOTBPXVDJZCS-UHFFFAOYSA-N
Data  1 IC50
  Tab Delimited (TSV)   2D SDfile   Computed 3D by Vconf -m prep SDfile
Find this compound or compounds like it in BindingDB:
Activity Spreadsheet -- Enzyme Inhibition Constant Data from BindingDB
Found 1 hit for monomerid = 50048989
TargetPolyunsaturated fatty acid 5-lipoxygenase(Rattus norvegicus)
Hoechst-Roussel Pharmaceuticals
Curated by ChEMBL
LigandPNGBDBM50048989(3-(6,11-Dihydro-dibenzo[b,e]oxepin-2-yl)-N-hydroxy...)
Affinity DataIC50:  20nM. Assay description: Inhibition of 5-lipoxygenase by measuring 5-HETE levels in RBL-1 cell-free supernatant
In DepthDetails ArticlePubMed