BDBM50048997 2-[2-(Hydroxy-isopropyl-amino)-ethyl]-6H-dibenzo[b,e]oxepin-11-one::CHEMBL83482
SMILES CC(C)N(O)CCc1ccc2OCc3ccccc3C(=O)c2c1
InChI Key InChIKey=RBNCKZNXLHDKGO-UHFFFAOYSA-N
Data  1 IC50
  Tab Delimited (TSV)   2D SDfile   Computed 3D by Vconf -m prep SDfile
Find this compound or compounds like it in BindingDB:
Activity Spreadsheet -- Enzyme Inhibition Constant Data from BindingDB
Found 1 hit for monomerid = 50048997
TargetPolyunsaturated fatty acid 5-lipoxygenase(Rattus norvegicus)
Hoechst-Roussel Pharmaceuticals
Curated by ChEMBL
LigandPNGBDBM50048997(2-[2-(Hydroxy-isopropyl-amino)-ethyl]-6H-dibenzo[b...)
Affinity DataIC50:  130nM. Assay description: Inhibition of 5-lipoxygenase by measuring 5-HETE levels in RBL-1 cell-free supernatant
In DepthDetails ArticlePubMed