BDBM50049001 CHEMBL315944::N-Cyclohexyl-N-hydroxy-2-(11-oxo-6,11-dihydro-dibenzo[b,e]oxepin-2-yl)-acetamide
SMILES ON(C1CCCCC1)C(=O)Cc1ccc2OCc3ccccc3C(=O)c2c1
InChI Key InChIKey=VWYUUGMRWGZFPM-UHFFFAOYSA-N
Data  1 IC50
  Tab Delimited (TSV)   2D SDfile   Computed 3D by Vconf -m prep SDfile
Find this compound or compounds like it in BindingDB:
Activity Spreadsheet -- Enzyme Inhibition Constant Data from BindingDB
Found 1 hit for monomerid = 50049001
TargetPolyunsaturated fatty acid 5-lipoxygenase(Rattus norvegicus)
Hoechst-Roussel Pharmaceuticals
Curated by ChEMBL
LigandPNGBDBM50049001(CHEMBL315944 | N-Cyclohexyl-N-hydroxy-2-(11-oxo-6,...)
Affinity DataIC50:  670nM. Assay description: Inhibition of 5-lipoxygenase by measuring 5-HETE levels in RBL-1 cell-free supernatant
In DepthDetails ArticlePubMed