BDBM50049006 CHEMBL85113::N-Hydroxy-N-isopropyl-3-(11-oxo-6,11-dihydro-dibenzo[b,e]oxepin-2-yl)-propionamide
SMILES CC(C)N(O)C(=O)CCc1ccc2OCc3ccccc3C(=O)c2c1
InChI Key InChIKey=RIHJUKPCBBKEOD-UHFFFAOYSA-N
Data  1 IC50
  Tab Delimited (TSV)   2D SDfile   Computed 3D by Vconf -m prep SDfile
Find this compound or compounds like it in BindingDB:
Activity Spreadsheet -- Enzyme Inhibition Constant Data from BindingDB
Found 1 hit for monomerid = 50049006
TargetPolyunsaturated fatty acid 5-lipoxygenase(Rattus norvegicus)
Hoechst-Roussel Pharmaceuticals
Curated by ChEMBL
LigandPNGBDBM50049006(CHEMBL85113 | N-Hydroxy-N-isopropyl-3-(11-oxo-6,11...)
Affinity DataIC50:  580nM. Assay description: Inhibition of 5-lipoxygenase by measuring 5-HETE levels in RBL-1 cell-free supernatant
In DepthDetails ArticlePubMed