BDBM50052790 CHEMBL3318589
SMILES Cc1cnn(c1)C(=O)N1CCCCC1
InChI Key InChIKey=OSNDHJDVIJJVOE-UHFFFAOYSA-N
Data  1 KI  4 IC50
  Tab Delimited (TSV)   2D SDfile   Computed 3D by Vconf -m prep SDfile
Find this compound or compounds like it in BindingDB:
Activity Spreadsheet -- Enzyme Inhibition Constant Data from BindingDB
Found 5 hits for monomerid = 50052790
TargetFatty-acid amide hydrolase 1 [30-579](Rattus norvegicus (rat))
The Scripps Research Institute
Curated by ChEMBL
LigandPNGBDBM50052790(CHEMBL3318589)
Affinity DataKi: >1.00E+3nM. Assay description: Inhibition of recombinant rat FAAH preincubated for 3 hrs
In DepthDetails ArticlePubMed
TargetMonoglyceride lipase(Mus musculus (mouse))
The Scripps Research Institute
Curated by ChEMBL
LigandPNGBDBM50052790(CHEMBL3318589)
Affinity DataIC50:  9.20E+3nM. Assay description: Inhibition of FP-rhodamine probe binding to MGLL in mouse brain membrane proteome preincubated for 1 hr followed by FP-rhodamine addition and measure...
In DepthDetails ArticlePubMed
TargetFatty-acid amide hydrolase 1(Mus musculus (mouse))
The Scripps Research Institute
Curated by ChEMBL
LigandPNGBDBM50052790(CHEMBL3318589)
Affinity DataIC50:  2.20E+3nM. Assay description: Inhibition of FP-rhodamine probe binding to FAAH in mouse brain membrane proteome preincubated for 1 hr followed by FP-rhodamine addition and measure...
In DepthDetails ArticlePubMed
TargetNeutral cholesterol ester hydrolase 1(Mus musculus (mouse))
The Scripps Research Institute
Curated by ChEMBL
LigandPNGBDBM50052790(CHEMBL3318589)
Affinity DataIC50: >1.00E+5nM. Assay description: Inhibition of FP-rhodamine probe binding to KIAA1363 in mouse brain membrane proteome preincubated for 1 hr followed by FP-rhodamine addition and mea...
In DepthDetails ArticlePubMed
TargetMonoacylglycerol lipase ABHD6(Mus musculus (mouse))
The Scripps Research Institute
Curated by ChEMBL
LigandPNGBDBM50052790(CHEMBL3318589)
Affinity DataIC50:  1.10E+3nM. Assay description: Inhibition of FP-rhodamine probe binding to ABHD6 in mouse brain membrane proteome preincubated for 1 hr followed by FP-rhodamine addition and measur...
In DepthDetails ArticlePubMed