BDBM50053172 4-Benzyl-2-dimethylamino-pyrimidine-5-carboxylic acid::CHEMBL122615
SMILES CN(C)c1ncc(C(O)=O)c(Cc2ccccc2)n1
InChI Key InChIKey=VQIZUSMHUSZRQN-UHFFFAOYSA-N
Data  1 IC50
  Tab Delimited (TSV)   2D SDfile   Computed 3D by Vconf -m prep SDfile
Find this compound or compounds like it in BindingDB:
Activity Spreadsheet -- Enzyme Inhibition Constant Data from BindingDB
Found 1 hit for monomerid = 50053172
TargetAdenosine receptor A1(GUINEA PIG)
Università
Curated by ChEMBL
LigandPNGBDBM50053172(4-Benzyl-2-dimethylamino-pyrimidine-5-carboxylic a...)
Affinity DataIC50:  5.83E+5nM. Assay description: Inhibition of [3H]-CHA binding to Adenosine A1 receptor in guinea pig heart
In DepthDetails ArticlePubMed