BDBM50059139 CHEMBL3393147
SMILES OC(=O)c1ccc[n+]2c([O-])c(sc12)-c1ccccc1
InChI Key InChIKey=KKZPXWXKLDGZAF-UHFFFAOYSA-N
Data  3 IC50
  Tab Delimited (TSV)   2D SDfile   Computed 3D by Vconf -m prep SDfile
Find this compound or compounds like it in BindingDB:
Activity Spreadsheet -- Enzyme Inhibition Constant Data from BindingDB
Found 3 hits for monomerid = 50059139
TargetProtein tyrosine phosphatase type IVA 2(Homo sapiens (Human))
European Molecular Biology Laboratory
Curated by ChEMBL
LigandPNGBDBM50059139(CHEMBL3393147)
Affinity DataIC50:  1.88E+5nM. Assay description: Inhibition of PRL2 (unknown origin) using DiFMUP as fluorogenic phosphate substrate assessed as DiFMUP dephosphorylation
In DepthDetails ArticlePubMed
TargetProtein tyrosine phosphatase type IVA 3(Homo sapiens (Human))
European Molecular Biology Laboratory
Curated by ChEMBL
LigandPNGBDBM50059139(CHEMBL3393147)
Affinity DataIC50:  1.02E+5nM. Assay description: Inhibition of PRL3 (unknown origin) using DiFMUP as fluorogenic phosphate substrate assessed as DiFMUP dephosphorylation
In DepthDetails ArticlePubMed
TargetProtein tyrosine phosphatase type IVA 1(Homo sapiens (Human))
European Molecular Biology Laboratory
Curated by ChEMBL
LigandPNGBDBM50059139(CHEMBL3393147)
Affinity DataIC50:  2.09E+5nM. Assay description: Inhibition of PRL1 (unknown origin) using DiFMUP as fluorogenic phosphate substrate assessed as DiFMUP dephosphorylation
In DepthDetails ArticlePubMed