BDBM50059142 CHEMBL3393150
SMILES CCOC(=O)C(=C\c1cc(Br)c(O)c(Br)c1)\C#N
InChI Key InChIKey=BEKZYRMZNTZRDB-FPYGCLRLSA-N
Data  3 IC50
  Tab Delimited (TSV)   2D SDfile   Computed 3D by Vconf -m prep SDfile
Find this compound or compounds like it in BindingDB:
Activity Spreadsheet -- Enzyme Inhibition Constant Data from BindingDB
Found 3 hits for monomerid = 50059142
TargetProtein tyrosine phosphatase type IVA 2(Homo sapiens (Human))
European Molecular Biology Laboratory
Curated by ChEMBL
LigandPNGBDBM50059142(CHEMBL3393150)
Affinity DataIC50:  1.09E+5nM. Assay description: Inhibition of PRL2 (unknown origin) using DiFMUP as fluorogenic phosphate substrate assessed as DiFMUP dephosphorylation
In DepthDetails ArticlePubMed
TargetProtein tyrosine phosphatase type IVA 3(Homo sapiens (Human))
European Molecular Biology Laboratory
Curated by ChEMBL
LigandPNGBDBM50059142(CHEMBL3393150)
Affinity DataIC50:  1.09E+5nM. Assay description: Inhibition of PRL3 (unknown origin) using DiFMUP as fluorogenic phosphate substrate assessed as DiFMUP dephosphorylation
In DepthDetails ArticlePubMed
TargetProtein tyrosine phosphatase type IVA 1(Homo sapiens (Human))
European Molecular Biology Laboratory
Curated by ChEMBL
LigandPNGBDBM50059142(CHEMBL3393150)
Affinity DataIC50:  8.91E+4nM. Assay description: Inhibition of PRL1 (unknown origin) using DiFMUP as fluorogenic phosphate substrate assessed as DiFMUP dephosphorylation
In DepthDetails ArticlePubMed