BDBM50061950 8-((E)-2-Benzo[1,3]dioxol-5-yl-vinyl)-3,7-dimethyl-1-prop-2-ynyl-3,7-dihydro-purine-2,6-dione::CHEMBL342229
SMILES Cn1c(\C=C\c2ccc3OCOc3c2)nc2n(C)c(=O)n(CC#C)c(=O)c12
InChI Key InChIKey=FTJJULSNSARIRX-SOFGYWHQSA-N
Data  3 KI
  Tab Delimited (TSV)   2D SDfile   Computed 3D by Vconf -m prep SDfile
Find this compound or compounds like it in BindingDB:
Activity Spreadsheet -- Enzyme Inhibition Constant Data from BindingDB
Found 3 hits for monomerid = 50061950
TargetAdenosine receptor A2a(Rattus norvegicus (rat))
Julius-Maximilians-UniversitäT WüRzburg
Curated by ChEMBL
LigandPNGBDBM50061950(8-((E)-2-Benzo[1,3]dioxol-5-yl-vinyl)-3,7-dimethyl...)
Affinity DataKi:  35nM. Assay description: Ability to inhibit binding of [3H]-CGS- 21680 to adenosine A2A receptor in rat brain striatal membranes.
In DepthDetails ArticlePubMed
TargetAdenosine receptor A2a(Rattus norvegicus (rat))
Julius-Maximilians-UniversitäT WüRzburg
Curated by ChEMBL
LigandPNGBDBM50061950(8-((E)-2-Benzo[1,3]dioxol-5-yl-vinyl)-3,7-dimethyl...)
Affinity DataKi:  35nM. Assay description: Binding affinity to A2A receptor in rat brain striatal membrane by radioligand displacement assay
In DepthDetails ArticlePubMed
TargetAdenosine receptor A1(Rattus norvegicus (rat))
Julius-Maximilians-UniversitäT WüRzburg
Curated by ChEMBL
LigandPNGBDBM50061950(8-((E)-2-Benzo[1,3]dioxol-5-yl-vinyl)-3,7-dimethyl...)
Affinity DataKi:  1.50E+3nM. Assay description: Ability to inhibit binding of [3H]-CHA to adenosine A1 receptor in rat brain cortical membranes.
In DepthDetails ArticlePubMed